{"text_format":"1","workbook":"xlsx","n_sheets":9,"sheets":["Start Here","Definitions","Compliance Indicators","Performance Summary","Document Mapping","Assessment Template","Action Plan","Opportunities for Improvement","Result"],"not_rendered":{"charts":0,"images":7,"macros":1,"external_links":1,"defined_names":26,"comments":0,"pivot_tables":0},"unopened":[],"bounds":{"document_bytes":16777216,"sheet_cells":100000,"rows_first":2000,"rows_last":500,"rows_between":2000,"halvings":0,"cell_chars":16384,"cell_head_chars":4096},"cells_cut":0,"cells_raw":0,"read":"whole","date_system":"1900"}

{"sheet":"Start Here","index":0,"n_rows":39,"n_cols":6,"rows_kept":39,"cut":false,"hidden":false,"merged":[[37,1,37,2],[28,1,28,6],[34,1,34,7],[33,2,33,5],[38,1,38,5],[30,1,30,6],[31,1,31,6],[32,1,32,6],[35,1,35,7],[24,1,24,7],[1,1,1,7],[29,1,29,7],[9,1,9,7],[6,1,6,5],[6,6,6,7],[2,1,2,7],[8,1,8,7],[4,2,5,3],[3,2,3,3],[26,1,26,6],[7,1,7,7],[15,5,15,6],[17,5,17,6],[14,1,14,7],[27,1,27,6],[10,5,10,6],[12,5,12,6],[23,1,23,7],[21,5,21,6],[19,5,19,6]]}
[]
[null," Start Here"]
[null,"Please enter organisation and assessment details below - these will automatically populate same fields replicated throughout the tool."]
[null,"Organisation name:",null,null,null,"Assessment date(s):"]
[null,"Sectors/ programs:",null,null,null,"Assessor name(s) & position(s):"]
[]
[]
[null,"Printing and Navigation"]
[null,"Use the buttons below to navigate and/or print selected pages. "]
[]
{"$rows_left_out":30}
{"sheet":"Definitions","index":1,"n_rows":17,"n_cols":5,"rows_kept":17,"cut":false,"hidden":false,"merged":[[10,1,10,3],[10,4,16,4],[11,2,11,3],[12,2,12,3],[13,2,13,3],[14,2,14,3],[15,2,15,3],[16,2,16,3],[8,1,8,3],[9,1,9,3],[6,1,6,3],[3,1,3,4],[0,1,0,4],[2,1,2,4],[5,1,5,3],[7,1,7,3],[4,1,4,4],[1,1,1,4]]}
[]
[null,"Definitions "]
[]
[null,"\"Definitions\" are used to define assessment result drop-down options."]
[null,"System means a set of rules, an arrangement of things, or a group of related things that work towards a common goal. i.e. procedures or processes of the organisation, which work together towards preventing, responding to and reporting of allegations of child abuse and harm."]
[null,"Definitions",null,null,"Report As"]
[null,"Not Assessed: rating applied if the Standard/ minimum requirement is not being assessed.",null,null,"Not Assessed"]
[null,"Met: rating applied when an aspect of the implemented system being assessed fully meets the requirements of the compliance minimum, demonstrating implementation of a system and the system is being maintained.",null,null,"Met"]
[null,"Partially Met: Some aspects or parts of the compliance minimum are met /evidenced while others are not. The interpretation of the Standard/compliance minimum is correct, but the manner of implementation is not effective enough.",null,null,"Partially Met"]
[null,"Not Met: rating applied when an aspect of the system being assessed does not meet the requirements of the compliance minimum, due to an absence of a system and/or strategy, or the failure to implement or maintain the system/strategy.",null,null,"Not Met"]
{"$rows_left_out":8}
{"sheet":"Compliance Indicators","index":2,"n_rows":197,"n_cols":4,"rows_kept":197,"cut":false,"hidden":false,"merged":[[44,3,44,12],[45,3,45,12],[46,3,46,12],[47,3,47,12],[48,3,48,12],[49,3,49,12],[50,3,50,12],[196,3,196,12],[187,3,187,12],[188,3,188,12],[189,3,189,12],[190,3,190,12],[191,3,191,12],[192,3,192,12],[193,3,193,12],[194,3,194,12],[195,3,195,12],[67,3,67,12],[68,3,68,12],[76,3,76,12],[77,3,77,12],[78,3,78,12],[79,3,79,12],[80,3,80,12],[81,3,81,12],[82,3,82,12],[118,3,118,12],[122,1,125,1],[126,1,131,1],[60,3,60,12],[61,3,61,12],[122,3,122,12],[123,3,123,12],[124,3,124,12],[125,3,125,12],[126,3,126,12],[127,3,127,12],[128,3,128,12],[89,1,89,12],[92,1,95,1],[90,3,90,12],[91,3,91,12],[92,3,92,12],[93,3,93,12],[94,3,94,12],[95,3,95,12],[85,3,85,12],[86,3,86,12],[87,3,87,12],[88,3,88,12],[58,3,58,12],[53,1,58,1],[107,1,113,1],[107,3,107,12],[108,3,108,12],[109,3,109,12],[110,3,110,12],[111,3,111,12],[112,3,112,12],[113,3,113,12],[98,3,98,12],[102,1,102,12],[98,1,101,1],[103,1,106,1],[99,3,99,12],[100,3,100,12],[101,3,101,12],[103,3,103,12],[104,3,104,12],[105,3,105,12],[106,3,106,12],[62,1,68,1],[62,3,62,12],[63,3,63,12],[64,3,64,12],[65,3,65,12],[66,3,66,12],[34,1,39,1],[35,3,35,12],[33,2,33,12],[40,1,40,12],[41,1,43,1],[44,1,50,1],[36,3,36,12],[37,3,37,12],[38,3,38,12],[39,3,39,12],[34,3,34,12],[41,3,41,12],[42,3,42,12],[43,3,43,12],[53,3,53,12],[54,3,54,12],[55,3,55,12],[59,1,59,12],[60,1,61,1],[56,3,56,12],[57,3,57,12],[7,1,7,12],[8,1,8,12],[17,1,21,1],[22,1,31,1],[11,1,15,1],[11,3,11,12],[12,3,12,12],[13,3,13,12],[14,3,14,12],[15,3,15,12],[10,2,10,12],[22,3,22,12],[23,3,23,12],[24,3,24,12],[25,3,25,12],[26,3,26,12],[27,3,27,12],[28,3,28,12],[29,3,29,12],[30,3,30,12],[31,3,31,12],[9,1,9,8],[134,1,137,1],[134,3,134,12],[135,3,135,12],[136,3,136,12],[137,3,137,12],[71,1,74,1],[75,1,75,12],[76,1,77,1],[78,1,82,1],[71,3,71,12],[72,3,72,12],[73,3,73,12],[74,3,74,12],[85,1,88,1],[90,1,91,1],[129,3,129,12],[130,3,130,12],[131,3,131,12],[119,3,119,12],[120,3,120,12],[116,1,120,1],[121,1,121,12],[116,3,116,12],[117,3,117,12],[138,1,138,12],[139,1,141,1],[142,1,146,1],[139,3,139,12],[140,3,140,12],[141,3,141,12],[142,3,142,12],[143,3,143,12],[144,3,144,12],[145,3,145,12],[146,3,146,12],[181,3,181,12],[149,3,149,12],[150,3,150,12],[151,3,151,12],[152,3,152,12],[149,1,152,1],[153,1,153,12],[154,1,157,1],[154,3,154,12],[155,3,155,12],[156,3,156,12],[157,3,157,12],[166,3,166,12],[173,3,173,12],[174,3,174,12],[175,3,175,12],[176,3,176,12],[177,3,177,12],[178,3,178,12],[170,3,170,12],[171,3,171,12],[172,1,172,12],[169,1,171,1],[173,1,174,1],[175,1,178,1],[180,2,180,12],[158,3,158,12],[159,3,159,12],[160,3,160,12],[161,3,161,12],[162,3,162,12],[163,3,163,12],[164,3,164,12],[165,3,165,12],[187,1,192,1],[193,1,196,1],[168,2,168,12],[52,2,52,12],[70,2,70,12],[133,2,133,12],[16,1,16,12],[97,2,97,12],[84,2,84,12],[115,2,115,12],[148,2,148,12],[19,3,19,12],[20,3,20,12],[21,3,21,12],[17,3,17,12],[18,3,18,12],[158,1,166,1],[181,1,185,1],[186,1,186,12],[182,3,182,12],[183,3,183,12],[184,3,184,12],[185,3,185,12],[169,3,169,12]]}
[]
[]
[]
[]
[]
[]
[]
[null,"Compliance Indicators"]
[null,"Compliance Indicators are prompts to help your organisation identify what policies, procedures and processes are in place, and what actions your organisation takes to protect children and young people. Compliance Indicators may also help your organisation identify potential gaps or opportunities for improvement. \n\nFor further information refer to the Commission for Children and Young People's resource A guide for creating a Child Safe Organisation"]
[null,"https://ccyp.vic.gov.au/resources/child-safe-standards/"]
{"$rows_left_out":188}
{"sheet":"Performance Summary","index":3,"n_rows":27,"n_cols":8,"rows_kept":27,"cut":false,"hidden":false,"merged":[[27,1,49,7],[25,1,25,7],[26,1,26,7],[1,1,1,7],[7,1,7,6],[2,1,2,7],[8,3,8,7],[9,2,10,2],[9,1,10,1],[9,3,9,7]]}
[]
[null,"Overall Performance Summary"]
[]
[null,"Organisation name:",{"$f":"'Start Here'!C4","v":0},"Dates:",{"$f":"'Start Here'!G4","v":"00:00:00"}]
[]
[null,"Sectors/ programs:",{"$f":"'Start Here'!C5","v":0},"Assessor name(s) and position(s):",{"$f":"'Start Here'!G5","v":0}]
[null,null,null,null,{"$f":"'Start Here'!G6","v":0}]
[null,null,null,null,null,null,null,{"$f":"'Start Here'!G7","v":0}]
[null,"Assessment Results"]
[null,"Standard","Outcome","Minimum Requirement Summary"]
{"$rows_left_out":18}
{"sheet":"Document Mapping","index":4,"n_rows":5,"n_cols":14,"rows_kept":5,"cut":false,"hidden":false,"merged":[]}
[]
[null,"Documented Evidence Mapping"]
[null,"List each organisational document that supports compliance with each Child Safe Standard and associated minimum requirement."]
[null,"Document No.","Document title /name","Standard 1 ","Standard 2","Standard 3","Standard 4","Standard 5","Standard 6","Standard 7","Standard 8","Standard 9","Standard 10","Standard 11"]
[null,"i.e. 1","Child Wellbeing and Safety Policy","1.1, 1.2, 1.3, 1.4, 1.5"]

{"sheet":"Assessment Template","index":5,"n_rows":73,"n_cols":48,"rows_kept":73,"cut":false,"hidden":false,"merged":[[65,2,65,5],[61,2,61,5],[51,2,51,5],[5,3,6,3],[4,1,4,5],[10,2,10,5],[16,2,16,5],[45,2,45,5],[56,2,56,5],[5,1,6,1],[7,1,7,2],[40,2,40,5],[30,2,30,5],[23,2,23,5],[35,2,35,5],[1,1,1,5],[2,1,2,5],[9,1,9,5]]}
[null,null,null,null,null,null,null,null,null,null,null,null,null,null,null,null,null,null,null,null,null,null,null,null,null,null,null,null,null,null,null,null,null,null,null,null,null,null,null,null,null,null,"OFI","Undetermined(no longer used)","Met","Partially Met","Not Met","Not Done"]
[null,"Self-Assessment Template",null,null,null,null,null,null,null,null,null,null,null,null,null,null,null,null,null,null,null,null,null,null,null,null,null,null,null,null,null,null,null,null,null,null,null,null,null,null,1,"Standard 1",{"$f":"SUM(AH12:AH16)","v":0},0,0,0,0,5]
[null,null,null,null,null,null,null,null,null,null,null,null,null,null,null,null,null,null,null,null,null,null,null,null,null,null,null,null,null,null,null,null,null,null,null,null,null,null,null,null,2,"Standard 2",{"$f":"SUM(AH18:AH23)","v":0},0,0,0,0,6]
[null,"Organisation name:",{"$f":"'Start Here'!C4","v":0},"Date(s):",{"$f":"'Start Here'!G4","v":"00:00:00"},null,null,null,null,null,null,null,null,null,null,null,null,null,null,null,null,null,null,null,null,null,null,null,null,null,null,null,null,null,null,null,null,null,null,null,3,"Standard 3",{"$f":"SUM(AH25:AH30)","v":0},0,0,0,0,6]
[null,null,null,null,null,null,null,null,null,null,null,null,null,null,null,null,null,null,null,null,null,null,null,null,null,null,null,null,null,null,null,null,null,null,null,null,null,null,null,null,4,"Standard 4",{"$f":"SUM(AH32:AH35)","v":0},0,0,0,0,4]
[null,"Sectors/ programs:",{"$f":"'Start Here'!C5","v":0},"Assessor name(s) and position(s):",{"$f":"'Start Here'!G5","v":0},null,null,null,null,null,null,null,null,null,null,null,null,null,null,null,null,null,null,null,null,null,null,null,null,null,null,null,null,null,null,null,null,null,null,null,5,"Standard 5",{"$f":"SUM(AH37:AH40)","v":0},0,0,0,0,4]
[null,null,null,null,{"$f":"'Start Here'!G6","v":0},null,null,null,null,null,null,null,null,null,null,null,null,null,null,null,null,null,null,null,null,null,null,null,null,null,null,null,null,null,null,null,null,null,null,null,6,"Standard 6",{"$f":"SUM(AH42:AH45)","v":0},0,0,0,0,4]
[null,"Requirement",null,"Result","Evidence/Comments\nEnsure to describe how your approach achieves each minimum requirement and Standard overall","Recommended Action/s",null,null,null,null,null,null,null,null,null,null,null,null,null,null,null,null,null,null,null,null,null,null,null,null,null,null,null,null,null,null,null,null,null,null,7,"Standard 7",{"$f":"SUM(AH47:AH51)","v":0},0,0,0,0,5]
[null,"Organisational overview - Capture an overview of your organisation including:  Organisational structure, no. of staff, key roles, responsibilities and governance, locations and services delivered and the typical age of children and young people accessing your services."]
[null,null,null,null,null,null,null,null,null,null,null,null,null,null,null,null,null,null,null,null,null,null,null,null,null,null,null,null,null,null,null,null,null,null,"undetermined not used",null,null,null,null,null,8,"Standard 8",{"$f":"SUM(AH53:AH56)","v":0},0,0,0,0,4]
{"$rows_left_out":64}
{"sheet":"Action Plan","index":6,"n_rows":54,"n_cols":23,"rows_kept":54,"cut":false,"hidden":false,"merged":[[2,1,2,8]]}
[]
[null,"This is an optional template to fill out to help your organisation to implement any identified actions"]
[null,"Action Plan"]
[null,"Standard Reference","Minimum requirement","Action\nNo.","Recommended Action/s","Agreed Action","Responsible person/ team\n","Target Completion Date","Status/Comments",null,null,null,null,null,null,null,null,null,null,null,null,null,1]
[null,{"$f":"IF(ISNA(VLOOKUP($W4,'Assessment Template'!$AD$12:$AG$72,2,FALSE)),\" \",VLOOKUP($W4,'Assessment Template'!$AD$12:$AG$72,2,FALSE))","v":" "},{"$f":"IF(ISNA(VLOOKUP($W4,'Assessment Template'!$AD$12:$AG$72,3,FALSE)),\" \",VLOOKUP($W4,'Assessment Template'!$AD$12:$AG$72,3,FALSE))","v":" "},"A1",{"$f":"IF(ISNA(VLOOKUP($W4,'Assessment Template'!$AD$12:$AG$72,4,FALSE)),\" \",VLOOKUP($W4,'Assessment Template'!$AD$12:$AG$72,4,FALSE))","v":" "},null,null,null,null,null,null,null,null,null,null,null,null,null,null,null,null,null,2]
[null,{"$f":"IF(ISNA(VLOOKUP($W5,'Assessment Template'!$AD$12:$AG$72,2,FALSE)),\" \",VLOOKUP($W5,'Assessment Template'!$AD$12:$AG$72,2,FALSE))","v":" "},{"$f":"IF(ISNA(VLOOKUP($W5,'Assessment Template'!$AD$12:$AG$72,3,FALSE)),\" \",VLOOKUP($W5,'Assessment Template'!$AD$12:$AG$72,3,FALSE))","v":" "},"A2",{"$f":"IF(ISNA(VLOOKUP($W5,'Assessment Template'!$AD$12:$AG$72,4,FALSE)),\" \",VLOOKUP($W5,'Assessment Template'!$AD$12:$AG$72,4,FALSE))","v":" "},null,null,null,null,null,null,null,null,null,null,null,null,null,null,null,null,null,3]
[null,{"$f":"IF(ISNA(VLOOKUP($W6,'Assessment Template'!$AD$12:$AG$72,2,FALSE)),\" \",VLOOKUP($W6,'Assessment Template'!$AD$12:$AG$72,2,FALSE))","v":" "},{"$f":"IF(ISNA(VLOOKUP($W6,'Assessment Template'!$AD$12:$AG$72,3,FALSE)),\" \",VLOOKUP($W6,'Assessment Template'!$AD$12:$AG$72,3,FALSE))","v":" "},"A3",{"$f":"IF(ISNA(VLOOKUP($W6,'Assessment Template'!$AD$12:$AG$72,4,FALSE)),\" \",VLOOKUP($W6,'Assessment Template'!$AD$12:$AG$72,4,FALSE))","v":" "},null,null,null,null,null,null,null,null,null,null,null,null,null,null,null,null,null,4]
[null,{"$f":"IF(ISNA(VLOOKUP($W7,'Assessment Template'!$AD$12:$AG$72,2,FALSE)),\" \",VLOOKUP($W7,'Assessment Template'!$AD$12:$AG$72,2,FALSE))","v":" "},{"$f":"IF(ISNA(VLOOKUP($W7,'Assessment Template'!$AD$12:$AG$72,3,FALSE)),\" \",VLOOKUP($W7,'Assessment Template'!$AD$12:$AG$72,3,FALSE))","v":" "},"A4",{"$f":"IF(ISNA(VLOOKUP($W7,'Assessment Template'!$AD$12:$AG$72,4,FALSE)),\" \",VLOOKUP($W7,'Assessment Template'!$AD$12:$AG$72,4,FALSE))","v":" "},null,null,null,null,null,null,null,null,null,null,null,null,null,null,null,null,null,5]
[null,{"$f":"IF(ISNA(VLOOKUP($W8,'Assessment Template'!$AD$12:$AG$72,2,FALSE)),\" \",VLOOKUP($W8,'Assessment Template'!$AD$12:$AG$72,2,FALSE))","v":" "},{"$f":"IF(ISNA(VLOOKUP($W8,'Assessment Template'!$AD$12:$AG$72,3,FALSE)),\" \",VLOOKUP($W8,'Assessment Template'!$AD$12:$AG$72,3,FALSE))","v":" "},"A5",{"$f":"IF(ISNA(VLOOKUP($W8,'Assessment Template'!$AD$12:$AG$72,4,FALSE)),\" \",VLOOKUP($W8,'Assessment Template'!$AD$12:$AG$72,4,FALSE))","v":" "},null,null,null,null,null,null,null,null,null,null,null,null,null,null,null,null,null,6]
[null,{"$f":"IF(ISNA(VLOOKUP($W9,'Assessment Template'!$AD$12:$AG$72,2,FALSE)),\" \",VLOOKUP($W9,'Assessment Template'!$AD$12:$AG$72,2,FALSE))","v":" "},{"$f":"IF(ISNA(VLOOKUP($W9,'Assessment Template'!$AD$12:$AG$72,3,FALSE)),\" \",VLOOKUP($W9,'Assessment Template'!$AD$12:$AG$72,3,FALSE))","v":" "},"A6",{"$f":"IF(ISNA(VLOOKUP($W9,'Assessment Template'!$AD$12:$AG$72,4,FALSE)),\" \",VLOOKUP($W9,'Assessment Template'!$AD$12:$AG$72,4,FALSE))","v":" "},null,null,null,null,null,null,null,null,null,null,null,null,null,null,null,null,null,7]
{"$rows_left_out":45}
{"sheet":"Opportunities for Improvement","index":7,"n_rows":54,"n_cols":34,"rows_kept":54,"cut":false,"hidden":false,"merged":[[0,1,0,7],[2,1,2,7]]}
[]
[null,"This is an optional template to fill out to help your organisation to implement any identified improvements"]
[null,"Opportunities for Improvement "]
[null,"Standard Reference","Minimum requirement","Opportunity No.","Recommended Improvement/s","Responsible person/team","Target Completion Date","Status/Comments"]
[null,{"$f":"IF(ISNA(VLOOKUP($AH5,'Assessment Template'!$AB$12:$AG$72,4,FALSE)),\" \",VLOOKUP($AH5,'Assessment Template'!$AB$12:$AG$72,4,FALSE))","v":" "},{"$f":"IF(ISNA(VLOOKUP($AH5,'Assessment Template'!$AB$12:$AG$72,5,FALSE)),\" \",VLOOKUP($AH5,'Assessment Template'!$AB$12:$AG$72,5,FALSE))","v":" "},"Op1",{"$f":"IF(ISNA(VLOOKUP($AH5,'Assessment Template'!$AB$12:$AG$72,6,FALSE)),\" \",VLOOKUP($AH5,'Assessment Template'!$AB$12:$AG$72,6,FALSE))","v":" "},null,null,null,null,null,null,null,null,null,null,null,null,null,null,null,null,null,null,null,null,null,null,null,null,null,null,null,null,1]
[null,{"$f":"IF(ISNA(VLOOKUP($AH6,'Assessment Template'!$AB$12:$AG$72,4,FALSE)),\" \",VLOOKUP($AH6,'Assessment Template'!$AB$12:$AG$72,4,FALSE))","v":" "},{"$f":"IF(ISNA(VLOOKUP($AH6,'Assessment Template'!$AB$12:$AG$72,5,FALSE)),\" \",VLOOKUP($AH6,'Assessment Template'!$AB$12:$AG$72,5,FALSE))","v":" "},"Op2",{"$f":"IF(ISNA(VLOOKUP($AH6,'Assessment Template'!$AB$12:$AG$72,6,FALSE)),\" \",VLOOKUP($AH6,'Assessment Template'!$AB$12:$AG$72,6,FALSE))","v":" "},null,null,null,null,null,null,null,null,null,null,null,null,null,null,null,null,null,null,null,null,null,null,null,null,null,null,null,null,2]
[null,{"$f":"IF(ISNA(VLOOKUP($AH7,'Assessment Template'!$AB$12:$AG$72,4,FALSE)),\" \",VLOOKUP($AH7,'Assessment Template'!$AB$12:$AG$72,4,FALSE))","v":" "},{"$f":"IF(ISNA(VLOOKUP($AH7,'Assessment Template'!$AB$12:$AG$72,5,FALSE)),\" \",VLOOKUP($AH7,'Assessment Template'!$AB$12:$AG$72,5,FALSE))","v":" "},"Op3",{"$f":"IF(ISNA(VLOOKUP($AH7,'Assessment Template'!$AB$12:$AG$72,6,FALSE)),\" \",VLOOKUP($AH7,'Assessment Template'!$AB$12:$AG$72,6,FALSE))","v":" "},null,null,null,null,null,null,null,null,null,null,null,null,null,null,null,null,null,null,null,null,null,null,null,null,null,null,null,null,3]
[null,{"$f":"IF(ISNA(VLOOKUP($AH8,'Assessment Template'!$AB$12:$AG$72,4,FALSE)),\" \",VLOOKUP($AH8,'Assessment Template'!$AB$12:$AG$72,4,FALSE))","v":" "},{"$f":"IF(ISNA(VLOOKUP($AH8,'Assessment Template'!$AB$12:$AG$72,5,FALSE)),\" \",VLOOKUP($AH8,'Assessment Template'!$AB$12:$AG$72,5,FALSE))","v":" "},"Op4",{"$f":"IF(ISNA(VLOOKUP($AH8,'Assessment Template'!$AB$12:$AG$72,6,FALSE)),\" \",VLOOKUP($AH8,'Assessment Template'!$AB$12:$AG$72,6,FALSE))","v":" "},null,null,null,null,null,null,null,null,null,null,null,null,null,null,null,null,null,null,null,null,null,null,null,null,null,null,null,null,4]
[null,{"$f":"IF(ISNA(VLOOKUP($AH9,'Assessment Template'!$AB$12:$AG$72,4,FALSE)),\" \",VLOOKUP($AH9,'Assessment Template'!$AB$12:$AG$72,4,FALSE))","v":" "},{"$f":"IF(ISNA(VLOOKUP($AH9,'Assessment Template'!$AB$12:$AG$72,5,FALSE)),\" \",VLOOKUP($AH9,'Assessment Template'!$AB$12:$AG$72,5,FALSE))","v":" "},"Op5",{"$f":"IF(ISNA(VLOOKUP($AH9,'Assessment Template'!$AB$12:$AG$72,6,FALSE)),\" \",VLOOKUP($AH9,'Assessment Template'!$AB$12:$AG$72,6,FALSE))","v":" "},null,null,null,null,null,null,null,null,null,null,null,null,null,null,null,null,null,null,null,null,null,null,null,null,null,null,null,null,5]
[null,{"$f":"IF(ISNA(VLOOKUP($AH10,'Assessment Template'!$AB$12:$AG$72,4,FALSE)),\" \",VLOOKUP($AH10,'Assessment Template'!$AB$12:$AG$72,4,FALSE))","v":" "},{"$f":"IF(ISNA(VLOOKUP($AH10,'Assessment Template'!$AB$12:$AG$72,5,FALSE)),\" \",VLOOKUP($AH10,'Assessment Template'!$AB$12:$AG$72,5,FALSE))","v":" "},"Op6",{"$f":"IF(ISNA(VLOOKUP($AH10,'Assessment Template'!$AB$12:$AG$72,6,FALSE)),\" \",VLOOKUP($AH10,'Assessment Template'!$AB$12:$AG$72,6,FALSE))","v":" "},null,null,null,null,null,null,null,null,null,null,null,null,null,null,null,null,null,null,null,null,null,null,null,null,null,null,null,null,6]
{"$rows_left_out":45}
{"sheet":"Result","index":8,"n_rows":9,"n_cols":1,"rows_kept":9,"cut":false,"hidden":true,"merged":[]}
["Result rating"]
[]
["Report As"]
["Select result"]
["Not Assessed"]
["Met"]
["Partially Met"]
["Not Met"]
["Opportunity for Improvement"]